{"text_format":"1","workbook":"xlsx","n_sheets":3,"sheets":["testi","faqepune","motori"],"not_rendered":{"charts":0,"images":68,"macros":1,"external_links":0,"defined_names":0,"comments":0,"pivot_tables":0},"unopened":[],"bounds":{"document_bytes":16777216,"sheet_cells":100000,"rows_first":2000,"rows_last":500,"rows_between":2000,"halvings":0,"cell_chars":16384,"cell_head_chars":4096},"cells_cut":0,"cells_raw":0,"read":"whole","date_system":"1900"}

{"sheet":"testi","index":0,"n_rows":52,"n_cols":18,"rows_kept":52,"cut":false,"hidden":false,"merged":[[10,12,10,14],[11,2,12,2],[6,1,6,2],[6,4,6,5],[6,10,6,11],[9,1,9,2],[9,4,9,5],[0,1,0,7],[1,1,2,7],[2,10,5,17],[3,1,3,7],[0,8,0,9]]}
[null,null,null,null,null,null,null,null,"Ndihme"]
[null,{"$f":"faqepune!F1","v":"Testi1  vetem me alternative"},null,null,null,null,null,null,null,null,{"$f":"faqepune!F3","v":"Udhezime per testimin:"}]
[null,null,null,null,null,null,null,null,null,null,{"$f":"faqepune!$F$4","v":"Për pyetjet me alternativa klikoni në alternativën e duhur (alternativa e saktë vlerësohet me 1 pikë, e pasakta me 0 pikë. Pasi të përfundoni testimin ruajeni ate. Dhe prisni mesuesin t'u hape elektronikisht vleresimin.                                                                                     Mesuesi te shikoje Ndihmen"}]
[null,{"$f":"faqepune!F2","v":"Profili natyror"}]
[]
[null,"*Emri:",null,null,"*Klasa:"]
[null,null,null,null,null,null,null,null,null,null,"Sistemi i pikëve:"]
[null,null,null,null,null,null,null,null,null,null,"Nota",4,5,6,7,8,9,10]
[null,"*Mbiemri:",null,null,"Data:",null,null,null,null,null,"Pikët",{"$f":"motori!E10","v":"[0, 3]"},{"$f":"motori!F10","v":"[4, 5]"},{"$f":"motori!G10","v":"[6, 7]"},{"$f":"motori!H10","v":"[8, 9]"},{"$f":"motori!I10","v":"[10, 11]"},{"$f":"motori!J10","v":"[12, 12]"},{"$f":"motori!K10","v":"[13, 13]"}]
[]
[null,null,null,null,null,null,null,null,null,"Kodi:",null,null,"Vlerësimi:                 Piket -",null,null,{"$f":"motori!I1","v":""}]
["Programoi","Fredi Luarasi",null,"Të dhënat e shënuara me asterisk (*) duhet të plotësohen domosdoshmërisht.",null,null,null,null,null,"(për mësuesin)",null,null,null,null,"Nota -",{"$f":"motori!G9","v":""}]
["Grafika","Rezart Naco"]
[]
["Usht.1"]
[null,null,null,"Perzgjidh",null,null,null,null,null,null,null,null,null,{"$f":"motori!E1","v":""}]
[]
["Usht.2"]
[null,null,null,"Perzgjidh",null,null,null,null,null,null,null,null,null,{"$f":"motori!E5","v":""}]
[]
["Usht.3"]
[null,null,null,"Perzgjidh",null,null,null,null,null,null,null,null,null,{"$f":"motori!E9","v":""}]
[]
["Usht.4"]
[null,null,null,"Perzgjidh",null,null,null,null,null,null,null,null,null,{"$f":"motori!E13","v":""}]
[]
["Usht.5"]
[null,null,null,"Perzgjidh",null,null,null,null,null,null,null,null,null,{"$f":"motori!E17","v":""}]
[]
["Usht.6"]
[null,null,null,"Perzgjidh",null,null,null,null,null,null,null,null,null,{"$f":"motori!E21","v":""}]
[]
["Usht.7"]
[null,null,null,"Perzgjidh",null,null,null,null,null,null,null,null,null,{"$f":"motori!E25","v":""}]
[]
["Usht.8"]
[null,null,null,"Perzgjidh",null,null,null,null,null,null,null,null,null,{"$f":"motori!E29","v":""}]
[]
["Usht.9"]
[null,null,null,"Perzgjidh",null,null,null,null,null,null,null,null,null,{"$f":"motori!E33","v":""}]
[]
["Usht.10"]
[null,null,null,"Perzgjidh",null,null,null,null,null,null,null,null,null,{"$f":"motori!E37","v":""}]
[]
["Usht.11"]
[null,null,null,"Perzgjidh",null,null,null,null,null,null,null,null,null,{"$f":"motori!E41","v":""}]
[]
["Usht.12"]
[null,null,null,"Perzgjidh",null,null,null,null,null,null,null,null,null,{"$f":"motori!E45","v":""}]
[]
["Usht.13"]
[null,null,null,"Perzgjidh",null,null,null,null,null,null,null,null,null,{"$f":"motori!E49","v":""}]

{"sheet":"faqepune","index":1,"n_rows":13,"n_cols":6,"rows_kept":13,"cut":false,"hidden":true,"merged":[[0,1,12,1],[3,5,6,12]]}
["c","Vendos alternativen e vertete per c'do ushtrim","Piket<=","Nota",null,"Testi1  vetem me alternative"]
["b",null,3,4,null,"Profili natyror"]
["d",null,5,5,null,"Udhezime per testimin:"]
["a",null,7,6,null,"Për pyetjet me alternativa klikoni në alternativën e duhur (alternativa e saktë vlerësohet me 1 pikë, e pasakta me 0 pikë. Pasi të përfundoni testimin ruajeni ate. Dhe prisni mesuesin t'u hape elektronikisht vleresimin.                                                                                     Mesuesi te shikoje Ndihmen"]
["b",null,9,7]
["b",null,11,8]
["d",null,12,9]
["a",null,13,10]
["d"]
["c",null,"Ndryshim paswordi","freluar1"]
["a"]
["c"]
["a"]

{"sheet":"motori","index":2,"n_rows":53,"n_cols":14,"rows_kept":53,"cut":false,"hidden":true,"merged":[]}
[{"$f":"faqepune!$A$1","v":"c"},true,{"$f":"IF(B1=TRUE,\"a\",\"\")","v":"a"},{"$f":"IF(OR(A1=C1,A2=C2,A3=C3,A4=C4),1,0)","v":0},{"$f":"IF($H$1=0,\"\",IF(AND($H$1=1,D1=1),\"mire\",\"gabim\"))","v":""},{"$f":"faqepune!C2","v":3},{"$f":"faqepune!D2","v":4},{"$f":"IF(AND(testi!B12=\"Fredi Luarasi\",testi!K11=N1),1,0)","v":0},{"$f":"IF($H$1=1,$D$53,\"\")","v":""},null,null,null,null,{"$f":"faqepune!D10","v":"freluar1"}]
[{"$f":"faqepune!$A$1","v":"c"},false,{"$f":"IF(B2=TRUE,\"b\",\"\")","v":""},null,null,{"$f":"faqepune!C3","v":5},{"$f":"faqepune!D3","v":5},null,null,null,null,null,"10A"]
[{"$f":"faqepune!$A$1","v":"c"},false,{"$f":"IF(B3=TRUE,\"c\",\"\")","v":""},null,null,{"$f":"faqepune!C4","v":7},{"$f":"faqepune!D4","v":6},null,null,null,null,null,"10B"]
[{"$f":"faqepune!$A$1","v":"c"},false,{"$f":"IF(B4=TRUE,\"d\",\"\")","v":""},null,null,{"$f":"faqepune!C5","v":9},{"$f":"faqepune!D5","v":7},null,null,null,null,null,"10C"]
[{"$f":"faqepune!$A$2","v":"b"},true,{"$f":"IF(B5=TRUE,\"a\",\"\")","v":"a"},{"$f":"IF(OR(A5=C5,A6=C6,A7=C7,A8=C8),1,0)","v":0},{"$f":"IF($H$1=0,\"\",IF(AND($H$1=1,D5=1),\"mire\",\"gabim\"))","v":""},{"$f":"faqepune!C6","v":11},{"$f":"faqepune!D6","v":8},null,null,null,null,null,"10D"]
[{"$f":"faqepune!$A$2","v":"b"},false,{"$f":"IF(B6=TRUE,\"b\",\"\")","v":""},null,null,{"$f":"faqepune!C7","v":12},{"$f":"faqepune!D7","v":9},null,null,null,null,null,"10E"]
[{"$f":"faqepune!$A$2","v":"b"},false,{"$f":"IF(B7=TRUE,\"c\",\"\")","v":""},null,null,{"$f":"faqepune!C8","v":13},{"$f":"faqepune!D8","v":10},null,null,null,null,null,"10F"]
[{"$f":"faqepune!$A$2","v":"b"},false,{"$f":"IF(B8=TRUE,\"d\",\"\")","v":""},null,null,null,null,null,null,null,null,null,"11A"]
[{"$f":"faqepune!$A$3","v":"d"},true,{"$f":"IF(B9=TRUE,\"a\",\"\")","v":"a"},{"$f":"IF(OR(A9=C9,A10=C10,A11=C11,A12=C12),1,0)","v":0},{"$f":"IF($H$1=0,\"\",IF(AND($H$1=1,D9=1),\"mire\",\"gabim\"))","v":""},"Nota",{"$f":"IF(I1<=F1,4,IF(I1<=F2,5,IF(I1<=F3,6,IF(I1<=F4,7,IF(I1<=F5,8,IF(I1<=F6,9,IF(I1<=F7,10,\"\")))))))","v":""},null,null,null,null,null,"11B"]
[{"$f":"faqepune!$A$3","v":"d"},false,{"$f":"IF(B10=TRUE,\"b\",\"\")","v":""},null,{"$f":"CONCATENATE(\"[\",\"0\",\", \",F1,\"]\")","v":"[0, 3]"},{"$f":"CONCATENATE(\"[\",F1+1,\", \",F2,\"]\")","v":"[4, 5]"},{"$f":"CONCATENATE(\"[\",F2+1,\", \",F3,\"]\")","v":"[6, 7]"},{"$f":"CONCATENATE(\"[\",F3+1,\", \",F4,\"]\")","v":"[8, 9]"},{"$f":"CONCATENATE(\"[\",F4+1,\", \",F5,\"]\")","v":"[10, 11]"},{"$f":"CONCATENATE(\"[\",F5+1,\", \",F6,\"]\")","v":"[12, 12]"},{"$f":"CONCATENATE(\"[\",F6+1,\", \",F7,\"]\")","v":"[13, 13]"},null,"11C"]
[{"$f":"faqepune!$A$3","v":"d"},false,{"$f":"IF(B11=TRUE,\"c\",\"\")","v":""},null,null,null,null,null,null,null,null,null,"11D"]
[{"$f":"faqepune!$A$3","v":"d"},false,{"$f":"IF(B12=TRUE,\"d\",\"\")","v":""},null,null,null,null,null,null,null,null,null,"11E"]
[{"$f":"faqepune!$A$4","v":"a"},true,{"$f":"IF(B13=TRUE,\"a\",\"\")","v":"a"},{"$f":"IF(OR(A13=C13,A14=C14,A15=C15,A16=C16),1,0)","v":1},{"$f":"IF($H$1=0,\"\",IF(AND($H$1=1,D13=1),\"mire\",\"gabim\"))","v":""},null,null,null,null,null,null,null,"11F"]
[{"$f":"faqepune!$A$4","v":"a"},false,{"$f":"IF(B14=TRUE,\"b\",\"\")","v":""},null,null,null,null,null,null,null,null,null,"12A"]
[{"$f":"faqepune!$A$4","v":"a"},false,{"$f":"IF(B15=TRUE,\"c\",\"\")","v":""},null,null,null,null,null,null,null,null,null,"12B"]
[{"$f":"faqepune!$A$4","v":"a"},false,{"$f":"IF(B16=TRUE,\"d\",\"\")","v":""},null,null,null,null,null,null,null,null,null,"12C"]
[{"$f":"faqepune!$A$5","v":"b"},true,{"$f":"IF(B17=TRUE,\"a\",\"\")","v":"a"},{"$f":"IF(OR(A17=C17,A18=C18,A19=C19,A20=C20),1,0)","v":0},{"$f":"IF($H$1=0,\"\",IF(AND($H$1=1,D17=1),\"mire\",\"gabim\"))","v":""},null,null,null,null,null,null,null,"12D"]
[{"$f":"faqepune!$A$5","v":"b"},false,{"$f":"IF(B18=TRUE,\"b\",\"\")","v":""},null,null,null,null,null,null,null,null,null,"12E"]
[{"$f":"faqepune!$A$5","v":"b"},false,{"$f":"IF(B19=TRUE,\"c\",\"\")","v":""},null,null,null,null,null,null,null,null,null,"12F"]
[{"$f":"faqepune!$A$5","v":"b"},false,{"$f":"IF(B20=TRUE,\"d\",\"\")","v":""}]
[{"$f":"faqepune!$A$6","v":"b"},true,{"$f":"IF(B21=TRUE,\"a\",\"\")","v":"a"},{"$f":"IF(OR(A21=C21,A22=C22,A23=C23,A24=C24),1,0)","v":0},{"$f":"IF($H$1=0,\"\",IF(AND($H$1=1,D21=1),\"mire\",\"gabim\"))","v":""}]
[{"$f":"faqepune!$A$6","v":"b"},false,{"$f":"IF(B22=TRUE,\"b\",\"\")","v":""}]
[{"$f":"faqepune!$A$6","v":"b"},false,{"$f":"IF(B23=TRUE,\"c\",\"\")","v":""}]
[{"$f":"faqepune!$A$6","v":"b"},false,{"$f":"IF(B24=TRUE,\"d\",\"\")","v":""}]
[{"$f":"faqepune!$A$7","v":"d"},true,{"$f":"IF(B25=TRUE,\"a\",\"\")","v":"a"},{"$f":"IF(OR(A25=C25,A26=C26,A27=C27,A28=C28),1,0)","v":0},{"$f":"IF($H$1=0,\"\",IF(AND($H$1=1,D25=1),\"mire\",\"gabim\"))","v":""}]
[{"$f":"faqepune!$A$7","v":"d"},false,{"$f":"IF(B26=TRUE,\"b\",\"\")","v":""}]
[{"$f":"faqepune!$A$7","v":"d"},false,{"$f":"IF(B27=TRUE,\"c\",\"\")","v":""}]
[{"$f":"faqepune!$A$7","v":"d"},false,{"$f":"IF(B28=TRUE,\"d\",\"\")","v":""}]
[{"$f":"faqepune!$A$8","v":"a"},true,{"$f":"IF(B29=TRUE,\"a\",\"\")","v":"a"},{"$f":"IF(OR(A29=C29,A30=C30,A31=C31,A32=C32),1,0)","v":1},{"$f":"IF($H$1=0,\"\",IF(AND($H$1=1,D29=1),\"mire\",\"gabim\"))","v":""}]
[{"$f":"faqepune!$A$8","v":"a"},false,{"$f":"IF(B30=TRUE,\"b\",\"\")","v":""}]
[{"$f":"faqepune!$A$8","v":"a"},false,{"$f":"IF(B31=TRUE,\"c\",\"\")","v":""}]
[{"$f":"faqepune!$A$8","v":"a"},false,{"$f":"IF(B32=TRUE,\"d\",\"\")","v":""}]
[{"$f":"faqepune!$A$9","v":"d"},true,{"$f":"IF(B33=TRUE,\"a\",\"\")","v":"a"},{"$f":"IF(OR(A33=C33,A34=C34,A35=C35,A36=C36),1,0)","v":0},{"$f":"IF($H$1=0,\"\",IF(AND($H$1=1,D33=1),\"mire\",\"gabim\"))","v":""}]
[{"$f":"faqepune!$A$9","v":"d"},false,{"$f":"IF(B34=TRUE,\"b\",\"\")","v":""}]
[{"$f":"faqepune!$A$9","v":"d"},false,{"$f":"IF(B35=TRUE,\"c\",\"\")","v":""}]
[{"$f":"faqepune!$A$9","v":"d"},false,{"$f":"IF(B36=TRUE,\"d\",\"\")","v":""}]
[{"$f":"faqepune!$A$10","v":"c"},true,{"$f":"IF(B37=TRUE,\"a\",\"\")","v":"a"},{"$f":"IF(OR(A37=C37,A38=C38,A39=C39,A40=C40),1,0)","v":0},{"$f":"IF($H$1=0,\"\",IF(AND($H$1=1,D37=1),\"mire\",\"gabim\"))","v":""}]
[{"$f":"faqepune!$A$10","v":"c"},false,{"$f":"IF(B38=TRUE,\"b\",\"\")","v":""}]
[{"$f":"faqepune!$A$10","v":"c"},false,{"$f":"IF(B39=TRUE,\"c\",\"\")","v":""}]
[{"$f":"faqepune!$A$10","v":"c"},false,{"$f":"IF(B40=TRUE,\"d\",\"\")","v":""}]
[{"$f":"faqepune!$A$11","v":"a"},true,{"$f":"IF(B41=TRUE,\"a\",\"\")","v":"a"},{"$f":"IF(OR(A41=C41,A42=C42,A43=C43,A44=C44),1,0)","v":1},{"$f":"IF($H$1=0,\"\",IF(AND($H$1=1,D41=1),\"mire\",\"gabim\"))","v":""}]
[{"$f":"faqepune!$A$11","v":"a"},false,{"$f":"IF(B42=TRUE,\"b\",\"\")","v":""}]
[{"$f":"faqepune!$A$11","v":"a"},false,{"$f":"IF(B43=TRUE,\"c\",\"\")","v":""}]
[{"$f":"faqepune!$A$11","v":"a"},false,{"$f":"IF(B44=TRUE,\"d\",\"\")","v":""}]
[{"$f":"faqepune!$A$12","v":"c"},true,{"$f":"IF(B45=TRUE,\"a\",\"\")","v":"a"},{"$f":"IF(OR(A45=C45,A46=C46,A47=C47,A48=C48),1,0)","v":0},{"$f":"IF($H$1=0,\"\",IF(AND($H$1=1,D45=1),\"mire\",\"gabim\"))","v":""}]
[{"$f":"faqepune!$A$12","v":"c"},false,{"$f":"IF(B46=TRUE,\"b\",\"\")","v":""}]
[{"$f":"faqepune!$A$12","v":"c"},false,{"$f":"IF(B47=TRUE,\"c\",\"\")","v":""}]
[{"$f":"faqepune!$A$12","v":"c"},false,{"$f":"IF(B48=TRUE,\"d\",\"\")","v":""}]
[{"$f":"faqepune!$A$13","v":"a"},true,{"$f":"IF(B49=TRUE,\"a\",\"\")","v":"a"},{"$f":"IF(OR(A49=C49,A50=C50,A51=C51,A52=C52),1,0)","v":1},{"$f":"IF($H$1=0,\"\",IF(AND($H$1=1,D49=1),\"mire\",\"gabim\"))","v":""}]
[{"$f":"faqepune!$A$13","v":"a"},false,{"$f":"IF(B50=TRUE,\"b\",\"\")","v":""}]
[{"$f":"faqepune!$A$13","v":"a"},false,{"$f":"IF(B51=TRUE,\"c\",\"\")","v":""}]
[{"$f":"faqepune!$A$13","v":"a"},false,{"$f":"IF(B52=TRUE,\"d\",\"\")","v":""}]
[null,null,"alternative",{"$f":"SUM(D1:D52)","v":4}]